== conf-sanity test 40: race during service thread startup ========================================================== 23:13:03 (1717557183) start ost1 service on oleg157-server Starting ost1: -o localrecov /dev/mapper/ost1_flakey /mnt/lustre-ost1 oleg157-server: mount.lustre: according to /etc/mtab /dev/mapper/ost1_flakey is already mounted on /mnt/lustre-ost1 pdsh@oleg157-client: oleg157-server: ssh exited with exit code 17 seq.cli-lustre-OST0000-super.width=65536 Start of /dev/mapper/ost1_flakey on ost1 failed 17 conf-sanity test_40: @@@@@@ FAIL: Unable to start OST1 Trace dump: = /home/green/git/lustre-release/lustre/tests/test-framework.sh:7066:error() = /home/green/git/lustre-release/lustre/tests/conf-sanity.sh:3577:test_40() = /home/green/git/lustre-release/lustre/tests/test-framework.sh:7411:run_one() = /home/green/git/lustre-release/lustre/tests/test-framework.sh:7474:run_one_logged() = /home/green/git/lustre-release/lustre/tests/test-framework.sh:7282:run_test() = /home/green/git/lustre-release/lustre/tests/conf-sanity.sh:3583:main() Dumping lctl log to /tmp/testlogs//conf-sanity.test_40.*.1717557186.log oleg157-client: error: couldn't open trace file oleg157-client: error: couldn't open trace file oleg157-server: error: couldn't open trace file oleg157-server: error: couldn't open trace file rsync: chown "/tmp/testlogs/.conf-sanity.test_40.debug_log.oleg157-server.1717557186.log.PvuYvc" failed: Operation not permitted (1) rsync: chown "/tmp/testlogs/.conf-sanity.test_40.dmesg.oleg157-server.1717557186.log.9SM2Lw" failed: Operation not permitted (1) rsync error: some files/attrs were not transferred (see previous errors) (code 23) at main.c(1651) [generator=3.1.2]