== conf-sanity test 38: MDS recreates missing lov_objid file from OST data ========================================================== 23:11:25 (1717557085) start mds service on oleg405-server Starting mds1: -o localrecov lustre-mdt1/mdt1 /mnt/lustre-mds1 oleg405-server: mount.lustre: according to /etc/mtab lustre-mdt1/mdt1 is already mounted on /mnt/lustre-mds1 pdsh@oleg405-client: oleg405-server: ssh exited with exit code 17 Start of lustre-mdt1/mdt1 on mds1 failed 17 conf-sanity test_38: @@@@@@ FAIL: MDT start failed Trace dump: = /home/green/git/lustre-release/lustre/tests/test-framework.sh:7066:error() = /home/green/git/lustre-release/lustre/tests/conf-sanity.sh:214:setup() = /home/green/git/lustre-release/lustre/tests/conf-sanity.sh:3491:test_38() = /home/green/git/lustre-release/lustre/tests/test-framework.sh:7411:run_one() = /home/green/git/lustre-release/lustre/tests/test-framework.sh:7474:run_one_logged() = /home/green/git/lustre-release/lustre/tests/test-framework.sh:7282:run_test() = /home/green/git/lustre-release/lustre/tests/conf-sanity.sh:3563:main() Dumping lctl log to /tmp/testlogs//conf-sanity.test_38.*.1717557087.log oleg405-client: error: couldn't open trace file oleg405-client: error: couldn't open trace file oleg405-server: error: couldn't open trace file oleg405-server: error: couldn't open trace file rsync: chown "/tmp/testlogs/.conf-sanity.test_38.debug_log.oleg405-server.1717557087.log.2Zbxcf" failed: Operation not permitted (1) rsync: chown "/tmp/testlogs/.conf-sanity.test_38.dmesg.oleg405-server.1717557087.log.Hy84qn" failed: Operation not permitted (1) rsync error: some files/attrs were not transferred (see previous errors) (code 23) at main.c(1651) [generator=3.1.2]